{"text_format":"1","workbook":"xlsx","n_sheets":16,"sheets":["Input","1-Instructions","2-Cover Page","3a-Budget Detail","3b- Equipment Detail","3c-Budget Summary","4a-AFR Detail","4b- AFR Equipment","4c-Annual Financial Report","5-District Code Table","6-Error Checking","Indirects 09-10","List Data","Sheet1","Sheet2","Notes"],"not_rendered":{"charts":0,"images":1,"macros":1,"external_links":1,"defined_names":12,"comments":5,"pivot_tables":0},"unopened":[],"bounds":{"document_bytes":16777216,"sheet_cells":100000,"rows_first":2000,"rows_last":500,"rows_between":2000,"halvings":0,"cell_chars":16384,"cell_head_chars":4096},"cells_cut":0,"cells_raw":0,"read":"whole","date_system":"1900"}

{"sheet":"Input","index":0,"n_rows":15,"n_cols":2,"rows_kept":15,"cut":false,"hidden":true,"merged":[[0,0,0,2]]}
["Input the following information and click the button:"]
["Grant name (\"grant\" will be added to end of name)","RTTT Ready Schools"]
["Grant manager","Marti Rodriguez"]
["Grant manager phone #","303-866-6769"]
["Grant manager e-mail","rodriguez_m@cde.state.co.us"]
["Prgram manager"]
["Project manager e-mail"]
["Program manager phone #"]
["Funding period","FY 2016-17"]
["Budget objects not allowed"]
["Budget objects not allowed"]
["State/Federal funds"]
[]
[]
[null,"**Protect workbook after clicking button**"]

{"sheet":"1-Instructions","index":1,"n_rows":79,"n_cols":2,"rows_kept":79,"cut":false,"hidden":false,"merged":[[73,0,73,1]]}
[null,{"$f":"+Input!B2&\" Grant\"","v":"RTTT Ready Schools Grant"}]
[null,"COMPUTERIZED/ELECTRONIC INTERFUND BUDGET"]
[]
[null,"IMPORTANT, PRINT THIS WORKSHEET BEFORE BEGINNING"]
[]
[null,"All applicants are required to use the electronic version of the budget forms.   There are no blank \"hard copies\" of the budget forms included as part of the application packet."]
[]
[null,"PLEASE REFER TO THE RFP FOR ALLOWABLE AND NON-ALLOWABLE EXPENSES COVERED UNDER THIS GRANT"]
[]
["INSTRUCTIONS/FEATURES OF THE ELECTRONIC BUDGET"]
[null,{"$f":"\"The following instructions will allow you to complete the computerized/electronic budget section of the \"&Input!B2& \" Grant.\"","v":"The following instructions will allow you to complete the computerized/electronic budget section of the RTTT Ready Schools Grant."}]
[]
[null,"The computerized application allows interaction among worksheets, calculates subtotals and totals automatically, links data from detail sheets, and calculates indirect costs automatically."]
[]
[null,{"$f":"\"The computerized electronic \"&Input!B2&\" Grant application budget contains the following 7 worksheets (notice the tabs near the bottom of the screen):\"","v":"The computerized electronic RTTT Ready Schools Grant application budget contains the following 7 worksheets (notice the tabs near the bottom of the screen):"}]
[]
[null,"1-Instructions, 2-Cover Page, 3-Budget Detail, 4-Budget Summary, 4c-Annual Financial Report, Notes"]
[]
[]
["General Budget Comments:"]
["1 -","Enter dollar amounts as whole dollars.  Do not enter cents."]
[]
["2 -","White cells can be typed in; gray cells cannot or should not be typed in."]
[]
["3 -",{"$f":"\"If a cell background turns red, it means something is wrong or incomplete - either the cell itself or some associated cell.  Do not submit this file if it contains any cells with a red background, call CDE, Grants Fiscal Management Services Unit, \" &Input!B3& \", \"&Input!B4&\" for assistance.\"","v":"If a cell background turns red, it means something is wrong or incomplete - either the cell itself or some associated cell.  Do not submit this file if it contains any cells with a red background, call CDE, Grants Fiscal Management Services Unit, Marti Rodriguez, 303-866-6769 for assistance."}]
[]
["General Spreadsheet Comments:"]
["1-","Do not cut and paste cells.  If you need to move cell contents, (1) copy and paste, then (2) delete the original content.  If you cut and paste you will invalidate the program, and you will have to re-enter all your data on a new file."]
["2-","Do not erase a cell entry in any worksheet with the space bar, instead use the delete key on the keyboard."]
["3-","Use the Zoom feature to change the size of the information on screen.   This will have no effect on the printout size."]
{"$rows_left_out":50}
{"sheet":"2-Cover Page","index":2,"n_rows":26,"n_cols":5,"rows_kept":26,"cut":false,"hidden":false,"merged":[[15,2,15,3],[0,0,0,5],[1,0,1,5],[13,2,13,3],[14,2,14,3],[5,2,5,3],[4,2,4,3],[2,2,2,4],[6,2,6,3]]}
[{"$f":"+Input!B2&\" Grant\"","v":"RTTT Ready Schools Grant"}]
[{"$f":"+Input!B9","v":"FY 2016-17"}]
[null,null,"Grant Period -November 1, 2016  through June 30, 2017"]
[null,"CFDA:  84-412",null,null,"STATE GRANT CODE: 5412"]
[null,"Enter District Code"]
[null,"District Name:",{"$f":"VLOOKUP(C5,'Indirects 09-10'!B4:D201,3,FALSE)","v":{"$error":"#N/A"}}]
[null,"Name of Charter School:"]
[]
[null,"Report:"]
[null,"Revision number:"]
[null,"Date:"]
[]
[null,"Name of person completing this information"]
[null,"Name:"]
[null,"Phone No.:"]
[null,"E-mail:"]
[]
[null,"SUBMIT FILE AND COMPLETED RFP TO:","competitive_grants@cde.state.co.us"]
[null,"Submit updated budget files after RFP Process to:","grants_fiscal@cde.state.co.us"]
[]
[]
[null,"Grants Fiscal Staff Contact ","Phone No.      E-mail Address"]
[null,"Marti Rodriguez","303-866-6769   rodriguez_m@cde.state.co.us"]
[]
[]
[null,null,{"$f":"+Input!B8&\"  \"&Input!B7","v":"  "}]

{"sheet":"3a-Budget Detail","index":3,"n_rows":6,"n_cols":4,"rows_kept":6,"cut":false,"hidden":false,"merged":[[3,0,3,1],[0,0,0,3],[2,0,2,3],[1,0,1,3]]}
[{"$f":"+Input!B2&\" Grant\"","v":"RTTT Ready Schools Grant"}]
["Budget Detail"]
[{"$f":"+Input!B9","v":"FY 2016-17"}]
[{"$f":"'2-Cover Page'!$C$6","v":{"$error":"#N/A"}},null,null,{"$f":"'2-Cover Page'!C11","v":"00:00:00"}]
[1,2,3,4]
["Program","Budget Object","Cost","Description"]

{"sheet":"3b- Equipment Detail","index":4,"n_rows":5,"n_cols":7,"rows_kept":5,"cut":false,"hidden":true,"merged":[[0,0,0,6],[1,0,1,6]]}
[{"$f":"+Input!B2&\" Grant\"","v":"RTTT Ready Schools Grant"}]
["EQUIPMENT REQUEST AND INVENTORY"]
[{"$f":"'2-Cover Page'!$C$6","v":{"$error":"#N/A"}},null,null,null,null,null,{"$f":"+'2-Cover Page'!C11","v":"00:00:00"}]
[1,2,3,"4b","4c",null,"6"]
["Description of item","Serial\nNumber","Date\nAcquired","Actual Cost","Capitalized/Non-Capitalized","Describe Use of Equipment","Expected Date\nof Completion"]

{"sheet":"3c-Budget Summary","index":5,"n_rows":38,"n_cols":8,"rows_kept":38,"cut":false,"hidden":false,"merged":[[6,0,6,1],[0,0,0,7],[1,0,1,7],[42,5,42,7],[2,1,2,7],[4,0,4,1],[5,0,5,1],[12,1,12,2],[21,1,21,2]]}
[{"$f":"+Input!B2&\" Grant\"","v":"RTTT Ready Schools Grant"}]
[{"$f":"+Input!B9","v":"FY 2016-17"}]
[]
[null,null,null,null,null,null,null," Date"]
["District:",null,{"$f":"'2-Cover Page'!C6","v":{"$error":"#N/A"}},null,null,null,null,{"$f":"'2-Cover Page'!C11","v":"00:00:00"}]
[null,null,null,null,null,"Revision","            "]
[null,null,null,null,null,"Budget Submission #:","            "]
[]
[null,null,"ALLOCATION FY 2016-17"]
[null,null,null,0]
[null,null,"TOTAL AVAILABLE",{"$f":"SUM(D9:D10)","v":0}]
[null,null,"PROGRAM CATEGORIES","Budget"]
[null,"Instructional Program"]
[null,1," Salaries (0100)",{"$f":"+SUM(IF(ISERROR(IF(LEFT('3a-Budget Detail'!$A$7:$A$501,4)&RIGHT('3a-Budget Detail'!$B$7:$B$501,5)=\"inst0100)\",'3a-Budget Detail'!$C$7:$C$501)),0,IF(LEFT('3a-Budget Detail'!$A$7:$A$501,4)&RIGHT('3a-Budget Detail'!$B$7:$B$501,5)=\"inst0100)\",'3a-Budget Detail'!$C$7:$C$501)))","v":0}]
[null,2," Employee Benefits (0200)",{"$f":"+SUM(IF(ISERROR(IF(LEFT('3a-Budget Detail'!$A$7:$A$501,4)&RIGHT('3a-Budget Detail'!$B$7:$B$501,5)=\"inst0200)\",'3a-Budget Detail'!$C$7:$C$501)),0,IF(LEFT('3a-Budget Detail'!$A$7:$A$501,4)&RIGHT('3a-Budget Detail'!$B$7:$B$501,5)=\"inst0200)\",'3a-Budget Detail'!$C$7:$C$501)))","v":0}]
[null,3," Purchased Professional & Technical Services (0300)",{"$f":"+SUM(IF(ISERROR(IF(LEFT('3a-Budget Detail'!$A$7:$A$501,4)&RIGHT('3a-Budget Detail'!$B$7:$B$501,5)=\"inst0300)\",'3a-Budget Detail'!$C$7:$C$501)),0,IF(LEFT('3a-Budget Detail'!$A$7:$A$501,4)&RIGHT('3a-Budget Detail'!$B$7:$B$501,5)=\"inst0300)\",'3a-Budget Detail'!$C$7:$C$501)))","v":0}]
[null,4,"Purchased Property Services (0400)",{"$f":"+SUM(IF(ISERROR(IF(LEFT('3a-Budget Detail'!$A$7:$A$501,4)&RIGHT('3a-Budget Detail'!$B$7:$B$501,5)=\"inst0400)\",'3a-Budget Detail'!$C$7:$C$501)),0,IF(LEFT('3a-Budget Detail'!$A$7:$A$501,4)&RIGHT('3a-Budget Detail'!$B$7:$B$501,5)=\"inst0400)\",'3a-Budget Detail'!$C$7:$C$501)))","v":0}]
[null,5," Other Purchased Services (0500)",{"$f":"+SUM(IF(ISERROR(IF(LEFT('3a-Budget Detail'!$A$7:$A$501,4)&RIGHT('3a-Budget Detail'!$B$7:$B$501,5)=\"inst0500)\",'3a-Budget Detail'!$C$7:$C$501)),0,IF(LEFT('3a-Budget Detail'!$A$7:$A$501,4)&RIGHT('3a-Budget Detail'!$B$7:$B$501,5)=\"inst0500)\",'3a-Budget Detail'!$C$7:$C$501)))","v":0}]
[null,6," Supplies (0600)",{"$f":"+SUM(IF(ISERROR(IF(LEFT('3a-Budget Detail'!$A$7:$A$501,4)&RIGHT('3a-Budget Detail'!$B$7:$B$501,5)=\"inst0600)\",'3a-Budget Detail'!$C$7:$C$501)),0,IF(LEFT('3a-Budget Detail'!$A$7:$A$501,4)&RIGHT('3a-Budget Detail'!$B$7:$B$501,5)=\"inst0600)\",'3a-Budget Detail'!$C$7:$C$501)))","v":0}]
[null,7," Other (0800)",{"$f":"+SUM(IF(ISERROR(IF(LEFT('3a-Budget Detail'!$A$7:$A$501,4)&RIGHT('3a-Budget Detail'!$B$7:$B$501,5)=\"inst0800)\",'3a-Budget Detail'!$C$7:$C$501)),0,IF(LEFT('3a-Budget Detail'!$A$7:$A$501,4)&RIGHT('3a-Budget Detail'!$B$7:$B$501,5)=\"inst0800)\",'3a-Budget Detail'!$C$7:$C$501)))","v":0}]
[null,8," Subtotal Instructional Program",{"$f":"SUM(D14:D20)","v":0}]
[null,"Support Program"]
[null,9," Salaries (0100)",{"$f":"+SUM(IF(ISERROR(IF(LEFT('3a-Budget Detail'!$A$7:$A$501,4)&RIGHT('3a-Budget Detail'!$B$7:$B$501,5)=\"supp0100)\",'3a-Budget Detail'!$C$7:$C$501)),0,IF(LEFT('3a-Budget Detail'!$A$7:$A$501,4)&RIGHT('3a-Budget Detail'!$B$7:$B$501,5)=\"supp0100)\",'3a-Budget Detail'!$C$7:$C$501)))","v":0}]
[null,10," Employee Benefits (0200)",{"$f":"+SUM(IF(ISERROR(IF(LEFT('3a-Budget Detail'!$A$7:$A$501,4)&RIGHT('3a-Budget Detail'!$B$7:$B$501,5)=\"supp0200)\",'3a-Budget Detail'!$C$7:$C$501)),0,IF(LEFT('3a-Budget Detail'!$A$7:$A$501,4)&RIGHT('3a-Budget Detail'!$B$7:$B$501,5)=\"supp0200)\",'3a-Budget Detail'!$C$7:$C$501)))","v":0}]
[null,11," Purchased Professional & Technical Services (0300)",{"$f":"+SUM(IF(ISERROR(IF(LEFT('3a-Budget Detail'!$A$7:$A$501,4)&RIGHT('3a-Budget Detail'!$B$7:$B$501,5)=\"supp0300)\",'3a-Budget Detail'!$C$7:$C$501)),0,IF(LEFT('3a-Budget Detail'!$A$7:$A$501,4)&RIGHT('3a-Budget Detail'!$B$7:$B$501,5)=\"supp0300)\",'3a-Budget Detail'!$C$7:$C$501)))","v":0}]
[null,12," Purchased Property Services (0400)",{"$f":"+SUM(IF(ISERROR(IF(LEFT('3a-Budget Detail'!$A$7:$A$501,4)&RIGHT('3a-Budget Detail'!$B$7:$B$501,5)=\"supp0400)\",'3a-Budget Detail'!$C$7:$C$501)),0,IF(LEFT('3a-Budget Detail'!$A$7:$A$501,4)&RIGHT('3a-Budget Detail'!$B$7:$B$501,5)=\"supp0400)\",'3a-Budget Detail'!$C$7:$C$501)))","v":0}]
[null,13," Other Purchased Services (0500)",{"$f":"+SUM(IF(ISERROR(IF(LEFT('3a-Budget Detail'!$A$7:$A$501,4)&RIGHT('3a-Budget Detail'!$B$7:$B$501,5)=\"supp0500)\",'3a-Budget Detail'!$C$7:$C$501)),0,IF(LEFT('3a-Budget Detail'!$A$7:$A$501,4)&RIGHT('3a-Budget Detail'!$B$7:$B$501,5)=\"supp0500)\",'3a-Budget Detail'!$C$7:$C$501)))","v":0}]
[null,14," Supplies (0600)",{"$f":"+SUM(IF(ISERROR(IF(LEFT('3a-Budget Detail'!$A$7:$A$501,4)&RIGHT('3a-Budget Detail'!$B$7:$B$501,5)=\"supp0600)\",'3a-Budget Detail'!$C$7:$C$501)),0,IF(LEFT('3a-Budget Detail'!$A$7:$A$501,4)&RIGHT('3a-Budget Detail'!$B$7:$B$501,5)=\"supp0600)\",'3a-Budget Detail'!$C$7:$C$501)))","v":0}]
[null,17," Property (0700)",{"$f":"+SUM(IF(ISERROR(IF(LEFT('3a-Budget Detail'!$A$7:$A$501,4)&RIGHT('3a-Budget Detail'!$B$7:$B$501,5)=\"supp0700)\",'3a-Budget Detail'!$C$7:$C$501)),0,IF(LEFT('3a-Budget Detail'!$A$7:$A$501,4)&RIGHT('3a-Budget Detail'!$B$7:$B$501,5)=\"supp0700)\",'3a-Budget Detail'!$C$7:$C$501)))","v":0}]
[null,15," Other (0800)",{"$f":"+SUM(IF(ISERROR(IF(LEFT('3a-Budget Detail'!$A$7:$A$501,4)&RIGHT('3a-Budget Detail'!$B$7:$B$501,5)=\"supp0800)\",'3a-Budget Detail'!$C$7:$C$501)),0,IF(LEFT('3a-Budget Detail'!$A$7:$A$501,4)&RIGHT('3a-Budget Detail'!$B$7:$B$501,5)=\"supp0800)\",'3a-Budget Detail'!$C$7:$C$501)))","v":0}]
{"$rows_left_out":9}
{"sheet":"4a-AFR Detail","index":6,"n_rows":6,"n_cols":4,"rows_kept":6,"cut":false,"hidden":false,"merged":[[0,0,0,3],[1,0,1,3],[2,0,2,3],[3,0,3,1]]}
[{"$f":"+Input!B2&\" Grant\"","v":"RTTT Ready Schools Grant"}]
["AFR Expenditure Detail"]
[{"$f":"+Input!B9","v":"FY 2016-17"}]
[{"$f":"'2-Cover Page'!$C$6","v":{"$error":"#N/A"}},null,null,{"$f":"'2-Cover Page'!C11","v":"00:00:00"}]
[1,2,3,4]
["Program","Budget Object","Cost","Description"]

{"sheet":"4b- AFR Equipment","index":7,"n_rows":5,"n_cols":6,"rows_kept":5,"cut":false,"hidden":true,"merged":[[0,0,0,5],[1,0,1,5]]}
[{"$f":"+Input!B2& \" Grant\"","v":"RTTT Ready Schools Grant"}]
["AFR Equipment Expenditure Detail"]
[{"$f":"'2-Cover Page'!$C$6","v":{"$error":"#N/A"}},null,null,null,null,{"$f":"+'2-Cover Page'!C11","v":"00:00:00"}]
[1,2,3,"4b","4c"]
["Description of item","Serial\nNumber","Date\nAcquired","Actual Cost","Capitalized/Non-Capitalized","Describe Use of Equipment"]

{"sheet":"4c-Annual Financial Report","index":8,"n_rows":42,"n_cols":9,"rows_kept":42,"cut":false,"hidden":false,"merged":[[1,0,1,8],[0,0,0,8],[2,0,2,8],[39,5,39,8],[3,1,3,8],[23,1,23,2],[5,0,5,1],[6,0,6,1],[14,1,14,2],[7,0,7,1]]}
[{"$f":"+Input!B2&\" Grant\"","v":"RTTT Ready Schools Grant"}]
["ANNUAL FINANCIAL REPORT"]
[{"$f":"+Input!B9","v":"FY 2016-17"}]
[]
[null,null,null,null,null,null,null,null,"Date"]
["District:",null,{"$f":"'2-Cover Page'!C6","v":{"$error":"#N/A"}}]
[null,null,null,null,null,null,"Revision","            "]
[null,null,"Due September 30, 2017",null,null,null,"Budget Submission #:","            "]
[]
[]
[]
[]
[]
[null,null,"PROGRAM CATEGORIES","Budget","Actual Expenditures"]
[null,"Instructional Program"]
[null,1," Salaries (0100)",{"$f":"'3c-Budget Summary'!$D14","v":0},{"$f":"+SUM(IFERROR((IF(LEFT('4a-AFR Detail'!$A$7:$A$500,4)&RIGHT('4a-AFR Detail'!$B$7:$B$500,5)=\"inst0100)\",'4a-AFR Detail'!$C$7:$C$500)),0))","v":0}]
[null,2," Employee Benefits (0200)",{"$f":"'3c-Budget Summary'!$D15","v":0},{"$f":"+SUM(IFERROR((IF(LEFT('4a-AFR Detail'!$A$7:$A$500,4)&RIGHT('4a-AFR Detail'!$B$7:$B$500,5)=\"inst0200)\",'4a-AFR Detail'!$C$7:$C$500)),0))","v":0}]
[null,3," Purchased Professional & Technical Services (0300)",{"$f":"'3c-Budget Summary'!$D16","v":0},{"$f":"+SUM(IFERROR((IF(LEFT('4a-AFR Detail'!$A$7:$A$500,4)&RIGHT('4a-AFR Detail'!$B$7:$B$500,5)=\"inst0300)\",'4a-AFR Detail'!$C$7:$C$500)),0))","v":0}]
[null,4,"Purchased Property Services (0400)",{"$f":"'3c-Budget Summary'!$D17","v":0},{"$f":"+SUM(IFERROR((IF(LEFT('4a-AFR Detail'!$A$7:$A$500,4)&RIGHT('4a-AFR Detail'!$B$7:$B$500,5)=\"inst0400)\",'4a-AFR Detail'!$C$7:$C$500)),0))","v":0}]
[null,5," Other Purchased Services (0500)",{"$f":"'3c-Budget Summary'!$D18","v":0},{"$f":"+SUM(IFERROR((IF(LEFT('4a-AFR Detail'!$A$7:$A$500,4)&RIGHT('4a-AFR Detail'!$B$7:$B$500,5)=\"inst0500)\",'4a-AFR Detail'!$C$7:$C$500)),0))","v":0}]
[null,6," Supplies (0600)",{"$f":"'3c-Budget Summary'!$D19","v":0},{"$f":"+SUM(IFERROR((IF(LEFT('4a-AFR Detail'!$A$7:$A$500,4)&RIGHT('4a-AFR Detail'!$B$7:$B$500,5)=\"inst0600)\",'4a-AFR Detail'!$C$7:$C$500)),0))","v":0}]
[null,7," Other (0800)",{"$f":"'3c-Budget Summary'!$D20","v":0},{"$f":"+SUM(IFERROR((IF(LEFT('4a-AFR Detail'!$A$7:$A$500,4)&RIGHT('4a-AFR Detail'!$B$7:$B$500,5)=\"inst0800)\",'4a-AFR Detail'!$C$7:$C$500)),0))","v":0}]
[null,8," Subtotal Instructional Program  ",{"$f":"SUM(D16:D22)","v":0},{"$f":"SUM(E16:E22)","v":0}]
[null,"Support Program"]
[null,9," Salaries (0100)",{"$f":"'3c-Budget Summary'!$D23","v":0},{"$f":"+SUM(IFERROR((IF(LEFT('4a-AFR Detail'!$A$7:$A$500,4)&RIGHT('4a-AFR Detail'!$B$7:$B$500,5)=\"supp0100)\",'4a-AFR Detail'!$C$7:$C$500)),0))","v":0}]
[null,10," Employee Benefits (0200)",{"$f":"'3c-Budget Summary'!$D24","v":0},{"$f":"+SUM(IFERROR((IF(LEFT('4a-AFR Detail'!$A$7:$A$500,4)&RIGHT('4a-AFR Detail'!$B$7:$B$500,5)=\"supp0200)\",'4a-AFR Detail'!$C$7:$C$500)),0))","v":0}]
[null,11," Purchased Professional & Technical Services (0300)",{"$f":"'3c-Budget Summary'!$D25","v":0},{"$f":"+SUM(IFERROR((IF(LEFT('4a-AFR Detail'!$A$7:$A$500,4)&RIGHT('4a-AFR Detail'!$B$7:$B$500,5)=\"supp0300)\",'4a-AFR Detail'!$C$7:$C$500)),0))","v":0}]
[null,12," Purchased Property Services (0400)",{"$f":"'3c-Budget Summary'!$D26","v":0},{"$f":"+SUM(IFERROR((IF(LEFT('4a-AFR Detail'!$A$7:$A$500,4)&RIGHT('4a-AFR Detail'!$B$7:$B$500,5)=\"supp0400)\",'4a-AFR Detail'!$C$7:$C$500)),0))","v":0}]
[null,13," Other Purchased Services (0500)",{"$f":"'3c-Budget Summary'!$D27","v":0},{"$f":"+SUM(IFERROR((IF(LEFT('4a-AFR Detail'!$A$7:$A$500,4)&RIGHT('4a-AFR Detail'!$B$7:$B$500,5)=\"supp0500)\",'4a-AFR Detail'!$C$7:$C$500)),0))","v":0}]
[null,14," Supplies (0600)",{"$f":"'3c-Budget Summary'!$D28","v":0},{"$f":"+SUM(IFERROR((IF(LEFT('4a-AFR Detail'!$A$7:$A$500,4)&RIGHT('4a-AFR Detail'!$B$7:$B$500,5)=\"supp0600)\",'4a-AFR Detail'!$C$7:$C$500)),0))","v":0}]
{"$rows_left_out":13}
{"sheet":"5-District Code Table","index":9,"n_rows":201,"n_cols":3,"rows_kept":201,"cut":false,"hidden":true,"merged":[[0,0,0,2]]}
["District Codes Table"]
["District Code","County","District Name"]
["0010","Adams","Mapleton 1"]
["0020","Adams","Adams 12 Five Star Schools"]
["0030","Adams","Adams County 14"]
["0040","Adams","Brighton 27J"]
["0050","Adams","Bennett 29J"]
["0060","Adams","Strasburg 31J"]
["0070","Adams","Westminster 50"]
["0100","Alamosa","Alamosa RE 11J"]
["0110","Alamosa","Sangre De Cristo RE-22J"]
["0120","Arapahoe","Englewood 1"]
["0123","Arapahoe","Sheridan 2"]
["0130","Arapahoe","Cherry Creek 5"]
["0140","Arapahoe","Littleton 6"]
["0170","Arapahoe","Deer Trail 26J"]
["0180","Arapahoe","Adams-Arapahoe 28 J"]
["0190","Arapahoe","Byers 32J"]
["0220","Archuleta","Archuleta County 50 JT"]
["0230","Baca","Walsh RE-1"]
["0240","Baca","Pritchett Re-3"]
["0250","Baca","Springfield RE-4"]
["0260","Baca","Vilas School District RE-5"]
["0270","Baca","Campo RE-6"]
["0290","Bent","Las Animas RE-1"]
["0310","Bent","McClave RE-2"]
["0470","Boulder","St Vrain Valley RE-1J"]
["0480","Boulder","Boulder Valley RE 2"]
["0490","Chaffee","Buena Vista R-31"]
["0500","Chaffee","Salida R 32 (J)"]
{"$rows_left_out":172}
{"sheet":"6-Error Checking","index":10,"n_rows":13,"n_cols":7,"rows_kept":13,"cut":false,"hidden":true,"merged":[[0,4,0,5],[0,6,0,10],[12,0,14,2],[0,0,0,2],[1,0,1,2],[3,0,3,2],[6,0,6,2],[4,0,4,2],[5,0,5,2],[9,0,9,2]]}
["ERROR CHECKING",null,null,null,"District:",null,{"$f":"'2-Cover Page'!C6","v":{"$error":"#N/A"}}]
[{"$f":"+Input!B2&\" Grant\"","v":"RTTT Ready Schools Grant"}]
[null,null,{"$f":"+'2-Cover Page'!C11","v":"00:00:00"}]
["Pupils Served"]
[{"$f":"'3c-Budget Summary'!D37","v":0}]
[{"$f":"IF(A5>1, \"\", \"Must Enter # of Pupils Served on 4-Budget Summary Sheet.\")","v":"Must Enter # of Pupils Served on 4-Budget Summary Sheet."}]
["Budget"]
["3a-Budget Detail","3c-Budget Summary"]
[{"$f":"SUM('3a-Budget Detail'!C7:C501)","v":0},{"$f":"'3c-Budget Summary'!D32","v":0},{"$f":"IF(A9=B9,\"Equal\",\"Not Equal\")","v":"Equal"}]
["Equipment"]
["3b-Equipment Detail","3c-Budget Summary"]
[{"$f":"+SUM('3b- Equipment Detail'!D10:D103)","v":0},{"$f":"+'3c-Budget Summary'!#REF!+'3c-Budget Summary'!#REF!","v":{"$error":"#REF!"}},{"$f":"IF(A12=B12,\"Equal\",\"Not Equal\")","v":{"$error":"#REF!"}}]
["If the subtotals do not equal each other, the most likely problem is on the detail sheet.  All required entries may not have been entered."]

{"sheet":"Indirects 09-10","index":11,"n_rows":201,"n_cols":8,"rows_kept":201,"cut":false,"hidden":true,"merged":[]}
["For Use In","Org Code","County","District Name",null,null,null,"Restricted "]
["School Year",null,null,null,null,null,null,"Rate"]
[]
[20092010,"0010","Adams","Mapleton Public Schools",null,5.7299999999999997E-2,0.21160000000000001,8.7900000000000009]
[20092010,"0020","Adams","Adams 12 Five Star Schools",null,6.1199999999999997E-2,0.17560000000000001,5.2299999999999995]
[20092010,"0030","Adams","Adams County 14",null,4.6899999999999997E-2,0.14460000000000001,6.34]
[20092010,"0040","Adams","Brighton 27J",null,7.4999999999999997E-2,0.23100000000000001,6.1400000000000006]
[20092010,"0050","Adams","Bennett 29J",null,5.1200000000000002E-2,0.22320000000000001,6.65]
[20092010,"0060","Adams","Strasburg 31J",null,2.1399999999999999E-2,0.30859999999999999,0.08]
[20092010,"0070","Adams","Westminster 50",null,9.0999999999999998E-2,0.22209999999999999,5.9700000000000006]
[20092010,"0100","Alamosa","Alamosa RE 11J",null,4.6600000000000003E-2,0.21360000000000001,2.6500000000000004]
[20092010,"0110","Alamosa","Sangre De Cristo RE-22J",null,6.6199999999999995E-2,0.29470000000000002,8.6199999999999992]
[20092010,"0120","Arapahoe","Englewood 1",null,7.0300000000000001E-2,0.23250000000000001,4.46]
[20092010,"0123","Arapahoe","Sheridan 2",null,9.0999999999999998E-2,0.20949999999999999,6.03]
[20092010,"0130","Arapahoe","Cherry Creek 5",null,4.6899999999999997E-2,0.15,3.0500000000000003]
[20092010,"0140","Arapahoe","Littleton 6",null,8.2699999999999996E-2,0.1988,6.79]
[20092010,"0170","Arapahoe","Deer Trail 26J",null,9.0999999999999998E-2,0.37430000000000002,10.500000000000002]
[20092010,"0180","Arapahoe","Adams-Arapahoe 28 J",null,8.7499999999999994E-2,0.2097,6.8900000000000006]
[20092010,"0190","Arapahoe","Byers 32J",null,7.6200000000000004E-2,0.25440000000000002,7.37]
[20092010,"0220","Archuleta","Archuleta County 50 JT",null,6.7299999999999999E-2,0.2324,10.500000000000002]
[20092010,"0230","Baca","Walsh RE-1",null,4.4299999999999999E-2,0.32569999999999999,2.06]
[20092010,"0240","Baca","Pritchett Re-3",null,9.0999999999999998E-2,0.45700000000000002,9.4499999999999993]
[20092010,"0250","Baca","Springfield RE-4",null,5.4699999999999999E-2,0.32400000000000001,2.7600000000000002]
[20092010,"0260","Baca","Vilas School District RE-5",null,1.14E-2,3.78E-2,10.500000000000002]
[20092010,"0270","Baca","Campo RE-6",null,1.2999999999999999E-2,0.5716,1.6400000000000001]
[20092010,"0290","Bent","Las Animas RE-1",null,3.5900000000000001E-2,0.187,5.65]
[20092010,"0310","Bent","McClave RE-2",null,4.4299999999999999E-2,0.27160000000000001,5.29]
[20092010,"0470","Boulder","St Vrain Valley RE-1J",null,2.4500000000000001E-2,0.1222,4.3900000000000006]
[20092010,"0480","Boulder","Boulder Valley RE 2",null,8.6900000000000005E-2,0.20599999999999999,2.2500000000000004]
[20092010,"0490","Chaffee","Buena Vista R-31",null,9.0999999999999998E-2,0.25430000000000003,2.89]
{"$rows_left_out":172}
{"sheet":"List Data","index":12,"n_rows":16,"n_cols":7,"rows_kept":16,"cut":false,"hidden":true,"merged":[]}
["Original Budget",null,{"$f":"IF(OR(Input!$B$11=\"Salaries (0100)\",Input!$B$10=\"Salaries (0100)\"),\"\",\"Salaries (0100)\")","v":"Salaries (0100)"},null,null,null,"Salaries (0100)"]
["Revised Budget",null,{"$f":"IF(OR(Input!$B$11=\"Employee Benefits (0200)\",Input!$B$10=\"Employee Benefits (0200)\"),\"\",\"Employee Benefits (0200)\")","v":"Employee Benefits (0200)"},null,null,null,"Employee Benefits (0200)"]
["Original AFR",null,{"$f":"IF(OR(Input!$B$11=\"Purchased Professional & Technical Services (0300)\",Input!$B$10=\"Purchased Professional & Technical Services (0300)\"),\"\",\"Purchased Professional & Technical Services (0300)\")","v":"Purchased Professional & Technical Services (0300)"},null,null,null,"Purchased Professional & Technical Services (0300)"]
["Revised AFR",null,{"$f":"IF(OR(Input!$B$11=\"Purchased Property Services (0400)\",Input!$B$10=\"Purchased Property Services (0400)\"),\"\",\"Purchased Property Services (0400)\")","v":"Purchased Property Services (0400)"},null,null,null,"Purchased Property Services (0400)"]
[null,null,{"$f":"IF(OR(Input!$B$11=\"Other Purchased Services (0500)\",Input!$B$10=\"Other Purchased Services (0500)\"),\"\",\"Other Purchased Services (0500)\")","v":"Other Purchased Services (0500)"},null,null,null,"Other Purchased Services (0500)"]
[null,null,{"$f":"IF(OR(Input!$B$11=\"Supplies (0600)\",Input!$B$10=\"Supplies (0600)\"),\"\",\"Supplies (0600)\")","v":"Supplies (0600)"},null,null,null,"Other (0800)"]
[null,null,"Other (0800)",null,null,null,"Supplies (0600)"]
[]
[]
[]
[]
[]
[]
[]
[null,null,"Instructional Program"]
[null,null,"Support Program"]

{"sheet":"Sheet1","index":13,"n_rows":0,"n_cols":0,"rows_kept":0,"cut":false,"hidden":true,"merged":[]}

{"sheet":"Sheet2","index":14,"n_rows":0,"n_cols":0,"rows_kept":0,"cut":false,"hidden":true,"merged":[]}

{"sheet":"Notes","index":15,"n_rows":7,"n_cols":2,"rows_kept":7,"cut":false,"hidden":false,"merged":[[5,0,5,1],[0,0,0,1],[1,0,1,1],[2,0,2,1]]}
[{"$f":"+Input!B2&\" Grant\"","v":"RTTT Ready Schools Grant"}]
["NOTES "]
[{"$f":"+Input!B9","v":"FY 2016-17"}]
[]
[null,{"$f":"'2-Cover Page'!$C$6","v":{"$error":"#N/A"}}]
[]
["Date","Comments"]